BDBM234017 US9353090, 145
SMILES Cc1ccc(OCc2ccc3CN(CCc3c2)C2CCOCC2)c(c1)-c1csc(n1)N1C[C@@H]2C[C@@]2(C1)C(O)=O
InChI Key InChIKey=CTSDVPDKHMTOCM-DLLPINGYSA-N
Data  1 EC50
  Tab Delimited (TSV)   2D SDfile   Computed 3D by Vconf -m prep SDfile
Find this compound or compounds like it in BindingDB:
Activity Spreadsheet -- Enzyme Inhibition Constant Data from BindingDB
Found 1 hit for monomerid = 234017
TargetGuanylate cyclase soluble subunit alpha-1/beta-1(Homo sapiens (Human))
Boehringer Ingelheim International
US Patent
LigandPNGBDBM234017(US9353090, 145)
Affinity DataEC50:  162nMT: 2°C. Assay description: The sGC cellular activator assay is performed in the presence and absence of 50% human serum (HS) using Chinese hamster ovary cells that have been st...
Ligand InfoPC cidPC sid
In DepthDetails US Patent